[Top][All Lists]

[Date Prev][Date Next][Thread Prev][Thread Next][Date Index][Thread Index]

Re: PSPP-BUG: error when building from master tarball

From: John Darrington
Subject: Re: PSPP-BUG: error when building from master tarball
Date: Mon, 6 Jul 2020 07:13:26 +0200
User-agent: Mutt/1.10.1 (2018-07-13)

On Sun, Jul 05, 2020 at 08:42:07PM +0000, Harry Thijssen wrote:
     I tried to build from Ben's master tarball and got:
     In file included from ./gl/time.h:44,
                      from ./src/data/dataset.h:20,
                      from src/data/any-reader.c:28:
     src/data/any-reader.c: In function 'any_reader_close':
     src/data/any-reader.c:135:42: error: 'const struct any_reader_class' has no
     member named 'rpl_close'; did you mean 'close'?
        return any_reader ? any_reader->klass->close (any_reader) : true;
     src/data/any-reader.c:136:1: warning: control reaches end of non-void
     function [-Wreturn-type]
     make[2]: *** [Makefile:8838: src/data/libdata_la-any-reader.lo] Error 1

Ugg!   Try putting '#undef close' after all the '#include' lines in


reply via email to

[Prev in Thread] Current Thread [Next in Thread]