[Top][All Lists]

[Date Prev][Date Next][Thread Prev][Thread Next][Date Index][Thread Index]

PSPP-BUG: [GNU PSPP 1.6.2] testsuite: 1220 failed

From: M Ilham Setya Aji
Subject: PSPP-BUG: [GNU PSPP 1.6.2] testsuite: 1220 failed
Date: Sun, 5 Nov 2023 11:03:06 +0700

You may investigate any problem if you feel able to do so, in which

case the test suite provides a good starting point.  Its output may

be found below `tests/testsuite.dir'.

make[3]: *** [tests_check] Error 1

make[2]: *** [check-am] Error 2

make[1]: *** [check-recursive] Error 1

make: *** [check] Error 2

If reporting this issue please do so at (not Homebrew/brew or Homebrew/homebrew-core):


Attachment: pspp.zip
Description: Zip archive

reply via email to

[Prev in Thread] Current Thread [Next in Thread]