[Top][All Lists]

[Date Prev][Date Next][Thread Prev][Thread Next][Date Index][Thread Index]


From: spy
Subject: bug-report
Date: Fri, 31 Oct 2008 19:13:47 +0800

HI,there are some error during in my installing. I don't know why.so i send it for some help.
thank you very much!
info :
PASS: test-strerror
PASS: test-string
PASS: test-strsignal
PASS: test-strstr
PASS: test-strtod
PASS: test-sys_stat
PASS: test-sys_time
Skipping test: multithreading not enabled
SKIP: test-tls
PASS: test-unistd
PASS: test-vasnprintf
PASS: test-vasprintf-posix
PASS: test-vasprintf
PASS: test-wchar
PASS: test-wctype
PASS: test-xvasprintf
2 of 58 tests failed
(3 tests were not run)
Please report to address@hidden
make[5]: *** [check-TESTS] Error 1
make[5]: Leaving directory `/gtktest/m4-1.4.12/tests'
make[4]: *** [check-am] Error 2
make[4]: Leaving directory `/gtktest/m4-1.4.12/tests'
make[3]: *** [check-recursive] Error 1
make[3]: Leaving directory `/gtktest/m4-1.4.12/tests'
make[2]: *** [check] Error 2
make[2]: Leaving directory `/gtktest/m4-1.4.12/tests'
make[1]: *** [check-recursive] Error 1
make[1]: Leaving directory `/gtktest/m4-1.4.12'
make: *** [check] Error 2
address@hidden m4-1.4.12]#

reply via email to

[Prev in Thread] Current Thread [Next in Thread]