[Top][All Lists]

[Date Prev][Date Next][Thread Prev][Thread Next][Date Index][Thread Index]

'make test' error

From: Bruce Dugan
Subject: 'make test' error
Date: Sun, 30 Nov 2008 20:40:25 -0800

I'm  not sure what system information you need.

  System Version: Mac OS X 10.5.5 (9F33)
  Kernel Version: Darwin 9.5.0

./configure ran successfully, however 'make test' threw the following error:

FAIL: test-c-stack2.sh

1 of 59 tests failed
(2 tests were not run)
Please report to address@hidden
make[5]: *** [check-TESTS] Error 1
make[4]: *** [check-am] Error 2
make[3]: *** [check-recursive] Error 1
make[2]: *** [check] Error 2
make[1]: *** [check-recursive] Error 1
make: *** [check] Error 2

reply via email to

[Prev in Thread] Current Thread [Next in Thread]