[Top][All Lists]

[Date Prev][Date Next][Thread Prev][Thread Next][Date Index][Thread Index]

Bus error

From: Thomas J. Duck
Subject: Bus error
Date: Wed, 3 Dec 2008 21:49:29 -0400

I have installed m4-1.4.12 on my Mac OS X 10.4 system. 'Make check' results in the error below. If there is any further information you need, please let me know. --Tom

Checking ./219.improved_f
Checking ./stackovf.test
Stack soft limit set to 300K
Failure - m4 aborted unexpectedly
Output from m4:
m4: internal error detected; please report this bug to <bug- address@hidden>: Bus error

Skipped checks were:
./116.changeword ./117.changeword ./118.changeword ./ 119.changeword ./120.changeword ./121.changeword
Failed checks were:
make[2]: *** [check] Error 1
make[1]: *** [check-recursive] Error 1
make: *** [check] Error 2


Thomas J. Duck <address@hidden>

Associate Professor,
Department of Physics and Atmospheric Science, Dalhousie University,
Halifax, Nova Scotia, Canada, B3H 3J5.
Tel: (902)494-1456 | Fax: (902)494-5191 | Lab: (902)494-3813
Web: http://aolab.phys.dal.ca/

reply via email to

[Prev in Thread] Current Thread [Next in Thread]