[Top][All Lists]
[Date Prev][Date Next][Thread Prev][Thread Next][Date Index][Thread Index]
[Build-inetutils] Hydra job gnu:inetutils-master:build build 1936179: Fa
From: |
Hydra Build Daemon |
Subject: |
[Build-inetutils] Hydra job gnu:inetutils-master:build build 1936179: Failed |
Date: |
Wed, 25 Jan 2012 23:52:56 +0100 |
Hi,
This is to let you know that Hydra build 1936179 of job
gnu:inetutils-master:build has changed from 'Dependency failed' to 'Failed'.
Complete build information can be found on this page:
http://hydra.nixos.org/build/1936179
The last 50 lines of the build log are shown at the bottom of this email.
A summary of the build information follows:
Build ID: | 1936179
Nix name: | inetutils-1.9.1.10-87b6-dirty
Short description: | Native Nix build on i686-solaris
Maintainer(s): | address@hidden, address@hidden
System: | i686-solaris
Derivation store path: |
/nix/store/d36zxa9vcjs30crwd0vlm2yy05mgm14x-inetutils-1.9.1.10-87b6-dirty.drv
Output store path: |
/nix/store/3lwf324hp09inc26v53b6w9c6ang3zlx-inetutils-1.9.1.10-87b6-dirty
Time added: | 2012-01-25 23:52:56
Build started: | 2012-01-25 23:50:09
Build finished: | 2012-01-25 23:52:56
Duration: | 167s
The build inputs were:
Name | Type | Value
------------+--------+--------------------------------------------------------------------------------------
hydraConfig | git |
git://git.savannah.gnu.org/hydra-recipes.git:98d096c5de1ec6e285d84e36ba3d4156da6f34ff
nixpkgs | svn | https://nixos.org/repos/nix/nixpkgs/trunk:31838
system | string | i686-solaris
tarball | build | 1936110
Regards,
The Hydra build daemon.
---
+ head -1
inetd (GNU inetutils) 1.9.1.10-87b6-dirty
+ eval '! false'
+ 2> /dev/null
+ :
+ id -u
+ [ 102 != 0 ]
+ echo 'ftpd needs to run as root'
ftpd needs to run as root
+ exit 77
SKIP: ftp-localhost.sh
+ ../src/hostname --version
hostname (GNU inetutils) 1.9.1.10-87b6-dirty
Copyright (C) 2012 Free Software Foundation, Inc.
License GPLv3+: GNU GPL version 3 or later <http://gnu.org/licenses/gpl.html>.
This is free software: you are free to change and redistribute it.
There is NO WARRANTY, to the extent permitted by law.
Written by Debarshi Ray.
+ errno=0
+ ../src/hostname
tweek
+ test 0 -eq 0
+ test 0 -eq 0
+ ../src/hostname
+ uname -n
+ test tweek = tweek
+ test 0 -eq 0
+ test 0 -eq 0
+ id -u
+ [ 102 != 0 ]
+ echo 'hostname: skipping tests to set host name'
hostname: skipping tests to set host name
+ exit 0
PASS: hostname.sh
======================================
1 of 5 tests failed
(3 tests were not run)
Please report to address@hidden
======================================
make[3]: *** [check-TESTS] Error 1
make[3]: Leaving directory
`/tmp/nix-build-d36zxa9vcjs30crwd0vlm2yy05mgm14x-inetutils-1.9.1.10-87b6-dirty.drv-0/inetutils-1.9.1.10-87b6-dirty/tests'
make[2]: *** [check-am] Error 2
make[2]: Leaving directory
`/tmp/nix-build-d36zxa9vcjs30crwd0vlm2yy05mgm14x-inetutils-1.9.1.10-87b6-dirty.drv-0/inetutils-1.9.1.10-87b6-dirty/tests'
make[1]: *** [check-recursive] Error 1
make[1]: Leaving directory
`/tmp/nix-build-d36zxa9vcjs30crwd0vlm2yy05mgm14x-inetutils-1.9.1.10-87b6-dirty.drv-0/inetutils-1.9.1.10-87b6-dirty'
make: *** [check] Error 2
build time elapsed: 0m0.033s 0m0.022s 1m11.662s 0m43.390s
Copying build directory to
/nix/store/3lwf324hp09inc26v53b6w9c6ang3zlx-inetutils-1.9.1.10-87b6-dirty/nix-build-d36zxa9vcjs30crwd0vlm2yy05mgm14x-inetutils-1.9.1.10-87b6-dirty.drv-0
build failed with exit code 2 (ignored)
[Prev in Thread] |
Current Thread |
[Next in Thread] |
- [Build-inetutils] Hydra job gnu:inetutils-master:build build 1936179: Failed,
Hydra Build Daemon <=