emacs-buildstatus
[Top][All Lists]
Advanced

[Date Prev][Date Next][Thread Prev][Thread Next][Date Index][Thread Index]

[Emacs-buildstatus] emacs | Pipeline #2861 has failed for emacs-26 | 15d


From: EMBA - Emacs Build Automation
Subject: [Emacs-buildstatus] emacs | Pipeline #2861 has failed for emacs-26 | 15de1d11
Date: Fri, 16 Aug 2019 10:13:38 -0400


Your pipeline has failed.

Project: emacs ( https://emba.gnu.org/emacs/emacs )
Branch: emacs-26 ( https://emba.gnu.org/emacs/emacs/commits/emacs-26 )

Commit: 15de1d11 ( 
https://emba.gnu.org/emacs/emacs/commit/15de1d11334fd7da3255881e0836a22d08760482
 )
Commit Message: Fix markup in dired-x.texi

* doc/misc/dired-x....
Commit Author: Eli Zaretskii

Pipeline #2861 ( https://emba.gnu.org/emacs/emacs/pipelines/2861 ) triggered by 
EMBA bot ( https://emba.gnu.org/bot )
had 1 failed build.

Job #3003 ( https://emba.gnu.org/emacs/emacs/-/jobs/3003/raw )

Stage: test
Name: test
Trace: make[2]: *** [check-doit] Error 1
Makefile:285: recipe for target 'check-doit' failed
make[2]: Leaving directory '/builds/emacs/emacs/test'
Makefile:255: recipe for target 'check' failed
make[1]: *** [check] Error 2
make[1]: Leaving directory '/builds/emacs/emacs/test'
Makefile:951: recipe for target 'check' failed
make: *** [check] Error 2
section_end:1565964812:build_script
section_start:1565964812:after_script
section_end:1565964814:after_script
section_start:1565964814:upload_artifacts_on_failure
section_end:1565964816:upload_artifacts_on_failure
ERROR: Job failed: exit code 1



-- 
You're receiving this email because of your account on emba.gnu.org.




reply via email to

[Prev in Thread] Current Thread [Next in Thread]