[Top][All Lists]

[Date Prev][Date Next][Thread Prev][Thread Next][Date Index][Thread Index]

[Gcl-devel] Problem building master

From: Blake McBride
Subject: [Gcl-devel] Problem building master
Date: Sat, 13 Aug 2016 20:55:23 -0500

When attempting to build master (with --enable-ansi) on 64 bit LinuxMint I get:

cat h/cmponly_last.h >>cmpinclude.h
./xbin/move-if-changed mv cmpinclude.h h/cmpinclude.h
cmpinclude.h and h/cmpinclude.h were not the same.
ln cmpinclude.h h/cmpinclude.h
./xbin/move-if-changed cp h/cmpinclude.h o/cmpinclude.h
h/cmpinclude.h and o/cmpinclude.h were not the same.
ln h/cmpinclude.h o/cmpinclude.h
(cd bin; make all)
make[1]: Entering directory `/home/blake/Backup/gcl.git/gcl/bin'
gcc  -I../h  -o append  append.c
gcc -I../h  -o file-sub file-sub.c
make[1]: Leaving directory `/home/blake/Backup/gcl.git/gcl/bin'
make mpfiles
make[1]: Entering directory `/home/blake/Backup/gcl.git/gcl'
make[1]: Nothing to be done for `mpfiles'.
make[1]: Leaving directory `/home/blake/Backup/gcl.git/gcl'
rm -f o/cmpinclude.h ; cp h/cmpinclude.h o
(cd o; make all)
make[1]: Entering directory `/home/blake/Backup/gcl.git/gcl/o'
gcc -c -fsigned-char  -pipe -Wall  -Wno-unused-but-set-variable -O3 -fomit-frame-pointer  -I/home/blake/Backup/gcl.git/gcl/o -I../h -I../gcl-tk typespec.c  
In file included from ../h/include.h:124:0,
                 from typespec.c:29:
../h/../h/new_decl.h:210:7: error: expected ‘=’, ‘,’, ‘;’, ‘asm’ or ‘__attribute__’ before ‘{’ token
make[1]: *** [typespec.o] Error 1
make[1]: Leaving directory `/home/blake/Backup/gcl.git/gcl/o'
make: *** [unixport/saved_pre_gcl] Error 2


Blake McBride

reply via email to

[Prev in Thread] Current Thread [Next in Thread]