[Top][All Lists]

[Date Prev][Date Next][Thread Prev][Thread Next][Date Index][Thread Index]

gnustep-back-0.9.4 link issue: _TIFFmalloc

From: T.J. Yang
Subject: gnustep-back-0.9.4 link issue: _TIFFmalloc
Date: Fri, 22 Oct 2004 22:49:19 -0500

1. Here is the error message
gmake[2]: Entering directory `/opt/build/gnustep-back-0.9.4/Source/xlib'
Making all for subproject xlib...
gmake[3]: Nothing to be done for `internal-subproject-all'.
gmake[2]: Leaving directory `/opt/build/gnustep-back-0.9.4/Source/xlib'
Making all for bundle libgnustep-back...
Copying localized resources into the bundle wrapper...
Copying resources from subprojects into the bundle wrapper...
gmake[1]: Leaving directory `/opt/build/gnustep-back-0.9.4/Source'
Making all in Tools...
gmake[1]: Entering directory `/opt/build/gnustep-back-0.9.4/Tools'
rm -f XGCommonFont.m
ln -s ../Source/xlib/XGCommonFont.m .
rm -f xdnd.c
ln -s ../Source/x11/xdnd.c .
Making all for tool gpbs...
Linking tool gpbs ...
Undefined                       first referenced
symbol                             in file
_TIFFmalloc /opt/TWWfsw/GNUstep/System/Library/Libraries/ _TIFFfree /opt/TWWfsw/GNUstep/System/Library/Libraries/ TIFFClientOpen /opt/TWWfsw/GNUstep/System/Library/Libraries/
ld: fatal: Symbol referencing errors. No output written to shared_obj/gpbs
collect2: ld returned 1 exit status
gmake[2]: *** [shared_obj/gpbs] Error 1
gmake[1]: *** [gpbs.all.tool.variables] Error 2
gmake[1]: Leaving directory `/opt/build/gnustep-back-0.9.4/Tools'
gmake: *** [internal-all] Error 2
     error: error executing script

2. I googled around and find this intertesting link.

But looks like the solution is to modified source code.
Any pointer ?

T.J. Yang

Check out Election 2004 for up-to-date election news, plus voter tools and more!

reply via email to

[Prev in Thread] Current Thread [Next in Thread]