[Top][All Lists]

[Date Prev][Date Next][Thread Prev][Thread Next][Date Index][Thread Index]

Re: Build failed in Jenkins: gnustep #256

From: Riccardo Mottola
Subject: Re: Build failed in Jenkins: gnustep #256
Date: Fri, 10 Aug 2012 15:42:28 +0200
User-agent: Mozilla/5.0 (X11; FreeBSD i386; rv:14.0) Gecko/20120802 Firefox/14.0.1 SeaMonkey/2.11


I just tried to build Gorm and it builds fine for me.

I'm a supporter of Jenkins as you know, but lately all your builds are failing and creating noise for the same reason in apparently the same place, there is something fishy perhaps?


address@hidden wrote:
See <>


[stefanbidi] Implemented CFPropertyListCreateDeepCopy() along with some helper 
functions to make it all work.


make[1]: Entering directory 
Making all for library GormCore...
obj/GormCore.obj/GormViewWindow.m.d:1: warning: NUL character seen; rest of 
line ignored
obj/GormCore.obj/GormViewWindow.m.d:1: *** missing separator.  Stop.
make[2]: *** [GormCore.all.library.variables] Error 2
make[1]: *** [internal-all] Error 2
make[1]: Leaving directory 
make: *** [internal-all] Error 2
Build step 'Execute shell' marked build as failure

Gnustep-dev mailing list

reply via email to

[Prev in Thread] Current Thread [Next in Thread]