help-cfengine
[Top][All Lists]
Advanced

[Date Prev][Date Next][Thread Prev][Thread Next][Date Index][Thread Index]

Re: cfengine-2.1.13 compile error redhat 7.2, 7.3


From: Brian E. Seppanen
Subject: Re: cfengine-2.1.13 compile error redhat 7.2, 7.3
Date: Wed, 2 Feb 2005 14:16:57 -0500 (EST)

On Wed, 2 Feb 2005, Brian E. Seppanen wrote:

> item.c: In function `FuzzyHostMatch':
> item.c:1042: parse error before `char'
> item.c:1066: `host_basename' undeclared (first use in this function)
> item.c:1066: (Each undeclared identifier is reported only once
> item.c:1066: for each function it appears in.)
> make[2]: *** [item.o] Error 1
> make[2]: Leaving directory `/usr/src/cfengine-2.1.13/src'
> make[1]: *** [all] Error 2
> make[1]: Leaving directory `/usr/src/cfengine-2.1.13/src'
> make: *** [all-recursive] Error 1

This seems to be related to gcc-2.9(5|6) because if I compile on debian 
3.1 with 2.95 I get the same error.   If I compile on debian 3.1 with gcc 
3.3 I can compile without any issues.

Hope that helps.  


Brian Seppanen
address@hidden
608.826.1464




reply via email to

[Prev in Thread] Current Thread [Next in Thread]