help-cfengine
[Top][All Lists]
Advanced

[Date Prev][Date Next][Thread Prev][Thread Next][Date Index][Thread Index]

cannot make cfengine


From: pommerer
Subject: cannot make cfengine
Date: Tue, 7 Mar 2006 14:25:39 +0100

Hello,
I tried to compile cfengine under Windows (XP). I did it as described
in http://www.cfengine.org/cfe4windoze.pdf.
After a successful "configure" I've got following errors:

--- 2.1.18 ---
$ make
Making all in pub
make[1]: Entering directory `/home/Administrator/cfengine-2.1.18/pub'
make[1]: Nothing to be done for `all'.
make[1]: Leaving directory `/home/Administrator/cfengine-2.1.18/pub'
Making all in src
make[1]: Entering directory `/home/Administrator/cfengine-2.1.18/src'
make  all-am
make[2]: Entering directory `/home/Administrator/cfengine-2.1.18/src'
/bin/sh ../ylwrap cfparse.y y.tab.c cfparse.c y.tab.h cfparse.h y.output
cfparse.output -- bison -y  -d
got /home/Administrator/cfengine-2\.1\.18/src/
../ylwrap: line 82:   612 Broken pipe             $prog ${1+"$@"}
"$input"
make[2]: *** [cfparse.c] Error 1
make[2]: Leaving directory `/home/Administrator/cfengine-2.1.18/src'
make[1]: *** [all] Error 2
make[1]: Leaving directory `/home/Administrator/cfengine-2.1.18/src'
make: *** [all-recursive] Error 1

--- 2.1.19 ---
$ make
Making all in pub
make[1]: Entering directory `/home/Administrator/cfengine-2.1.19/pub'
make[1]: Nothing to be done for `all'.
make[1]: Leaving directory `/home/Administrator/cfengine-2.1.19/pub'
Making all in src
make[1]: Entering directory `/home/Administrator/cfengine-2.1.19/src'
make  all-am
make[2]: Entering directory `/home/Administrator/cfengine-2.1.19/src'
if gcc -DHAVE_CONFIG_H -I. -I. -I. -I/usr/local/BerkeleyDB.4.4/include
-I/usr/include   -g -O2 -Wreturn-type -Wmissing-prototypes
-Wuninitialized  -g -O2 -I/usr/local/BerkeleyDB.4.4/include   -g -O2
-I/usr/local/BerkeleyDB.4.4/include -MT patches.o -MD -MP -MF
".deps/patches.Tpo" -c -o patches.o pa
ches.c; \
then mv -f ".deps/patches.Tpo" ".deps/patches.Po"; else rm -f
".deps/patches.Tpo"; exit 1; fi
patches.c: In function `setnetgrent':
patches.c:92: error: argument `netgroup' doesn't match prototype
prototypes.h:803: error: prototype declaration
make[2]: *** [patches.o] Error 1
make[2]: Leaving directory `/home/Administrator/cfengine-2.1.19/src'
make[1]: *** [all] Error 2
make[1]: Leaving directory `/home/Administrator/cfengine-2.1.19/src'
make: *** [all-recursive] Error 1

Who can help me?

Regards
Werner

---------------------------------------------------------- 
Werner Pommerer           email: address@hidden 
Rechenzentrum             Universität Hohenheim 
Schloß Westhof Süd        Telefon: +49 (0711) 459 2837 
70593 Stuttgart           Fax:     +49 (0711) 459 3449 
---------------------------------------------------------- 






reply via email to

[Prev in Thread] Current Thread [Next in Thread]