[Date Prev][Date Next][Thread Prev][Thread Next][Date Index][Thread Index]
[Octave-bug-tracker] [bug #63922] parallel: no member named 'cdef_object
From: |
anonymous |
Subject: |
[Octave-bug-tracker] [bug #63922] parallel: no member named 'cdef_object' in namespace 'octave' |
Date: |
Sat, 8 Apr 2023 22:17:40 -0400 (EDT) |
Follow-up Comment #3, bug #63922 (project octave):
I'm still getting this error regarding cdef_object:
/usr/include/octave-8.1.0/octave/../octave/Array.cc:38:67: error:
'cdef_object' is not a member of 'octave'
38 | extern template class OCTINTERP_EXTERN_TEMPLATE_API
Array<octave::cdef_object>;
|
^~~~~~~~~~~
/usr/include/octave-8.1.0/octave/../octave/Array.cc:38:78: error: template
argument 1 is invalid
38 | extern template class OCTINTERP_EXTERN_TEMPLATE_API
Array<octave::cdef_object>;
|
^
/usr/include/octave-8.1.0/octave/../octave/Array.cc:38:78: error: template
argument 2 is invalid
make: *** [Makefile:192: p-connection.o] Error 1
This was my patch for the configure test:
diff --git a/src/configure.ac b/src/configure.ac
index 69f3aba..bc1c85a 100644
--- a/src/configure.ac
+++ b/src/configure.ac
@@ -244,9 +244,9 @@ dnl separate test
],
[dnl
- [symbol_table::assign],
[octave::interpreter::the_interpreter () -> get_symbol_table ().assign],
- [[octave::interpreter::the_interpreter () -> get_symbol_table ();]],
+ [octave::interpreter::the_interpreter () -> assign],
+ [[octave::interpreter::the_interpreter () ->
assign("socket",octave_value(0));]],
[OCTAVE__INTERPRETER__SYMBOL_TABLE__ASSIGN],
[[#include <octave/symtab.h>]],
[]
diff --git a/src/error-helpers.h b/src/error-helpers.h
_______________________________________________________
Reply to this item at:
<https://savannah.gnu.org/bugs/?63922>
_______________________________________________
Message sent via Savannah
https://savannah.gnu.org/
- [Octave-bug-tracker] [bug #63922] parallel: no member named 'cdef_object' in namespace 'octave',
anonymous <=
- Message not available
- [Octave-bug-tracker] [bug #63922] parallel: no member named 'cdef_object' in namespace 'octave', anonymous, 2023/04/08
- Message not available
- [Octave-bug-tracker] [bug #63922] [octave forge] (parallel) no member named 'cdef_object' in namespace 'octave', Markus Mützel, 2023/04/17
- [Octave-bug-tracker] [bug #63922] [octave forge] (parallel) no member named 'cdef_object' in namespace 'octave', anonymous, 2023/04/17
- Message not available
- [Octave-bug-tracker] [bug #63922] [octave forge] (parallel) no member named 'cdef_object' in namespace 'octave', Markus Mützel, 2023/04/18
- [Octave-bug-tracker] [bug #63922] [octave forge] (parallel) no member named 'cdef_object' in namespace 'octave', anonymous, 2023/04/18
- Message not available
- [Octave-bug-tracker] [bug #63922] [octave forge] (parallel) no member named 'cdef_object' in namespace 'octave', Markus Mützel, 2023/04/18
- [Octave-bug-tracker] [bug #63922] [octave forge] (parallel) no member named 'cdef_object' in namespace 'octave', Markus Mützel, 2023/04/18
- [Octave-bug-tracker] [bug #63922] [octave forge] (parallel) no member named 'cdef_object' in namespace 'octave', anonymous, 2023/04/18
- Message not available
- [Octave-bug-tracker] [bug #63922] [octave forge] (parallel) no member named 'cdef_object' in namespace 'octave', anonymous, 2023/04/18
- Message not available
- [Octave-bug-tracker] [bug #63922] [octave forge] (parallel) no member named 'cdef_object' in namespace 'octave', Markus Mützel, 2023/04/18