[Top][All Lists]

[Date Prev][Date Next][Thread Prev][Thread Next][Date Index][Thread Index]

2.1.15 compile error

From: Zeev Fisher
Subject: 2.1.15 compile error
Date: Tue, 02 Aug 2005 12:38:17 +0300


I'm trying to compile 2.1.15 on RHEL4 update 1 , openssl 0.9.8,DB
version 4.3.28

After several minutes , I get the following error:

then mv -f ".deps/errors.Tpo" ".deps/errors.Po"; else rm -f
".deps/errors.Tpo"; exit 1; fi
/bin/sh ../ylwrap cflex.l .c cflex.c
-- /bin/sh /tmp/cfengine-2.1.15/missing --run flex
got /tmp/cfengine-2\.1\.15/src/
make[2]: *** [cflex.c] Error 1
make[2]: Leaving directory `/tmp/cfengine-2.1.15/src'
make[1]: *** [all] Error 2
make[1]: Leaving directory `/tmp/cfengine-2.1.15/src'
make: *** [all-recursive] Error 1

Does anybody have an idea ?


reply via email to

[Prev in Thread] Current Thread [Next in Thread]