[Top][All Lists]

[Date Prev][Date Next][Thread Prev][Thread Next][Date Index][Thread Index]

Re: 2.1.15 compile error

From: Jeff Sheltren
Subject: Re: 2.1.15 compile error
Date: Tue, 2 Aug 2005 08:04:52 -0700

On Aug 2, 2005, at 2:38 AM, Zeev Fisher wrote:


I'm trying to compile 2.1.15 on RHEL4 update 1 , openssl 0.9.8,DB
version 4.3.28

After several minutes , I get the following error:

then mv -f ".deps/errors.Tpo" ".deps/errors.Po"; else rm -f
".deps/errors.Tpo"; exit 1; fi
/bin/sh ../ylwrap cflex.l .c cflex.c
-- /bin/sh /tmp/cfengine-2.1.15/missing --run flex
got /tmp/cfengine-2\.1\.15/src/
make[2]: *** [cflex.c] Error 1
make[2]: Leaving directory `/tmp/cfengine-2.1.15/src'
make[1]: *** [all] Error 2
make[1]: Leaving directory `/tmp/cfengine-2.1.15/src'
make: *** [all-recursive] Error 1

Does anybody have an idea ?


Is there a reason you are compiling it and not using an RPM? It looks like the fedora extras package of cfengine is available for CentOS4 (RHEL4) here:
If you point yum to that (see instructions on web page), you should be able to do a 'yum install cfengine'.

As for your error - do you have flex installed?


reply via email to

[Prev in Thread] Current Thread [Next in Thread]